{"text_format":"1","workbook":"xlsx","n_sheets":10,"sheets":["Intro","Ref_sys","New_tech","sLCA","Inputs","Results","Parameter_tables","LCA_variables","Pictures","My_techn"],"not_rendered":{"charts":5,"images":26,"macros":1,"external_links":0,"defined_names":2,"comments":0,"pivot_tables":0},"unopened":[],"bounds":{"document_bytes":16777216,"sheet_cells":100000,"rows_first":2000,"rows_last":500,"rows_between":2000,"halvings":0,"cell_chars":16384,"cell_head_chars":4096},"cells_cut":0,"cells_raw":0,"read":"whole","date_system":"1900"}

{"sheet":"Intro","index":0,"n_rows":6,"n_cols":1,"rows_kept":6,"cut":false,"hidden":false,"merged":[]}
["Decision Supporting System developed in project INCOVER"]
["\nThis spreadsheet model, the Decision Support System  (DSS) was developed in the INCOVER project (https://incover-project.eu/) evaluating technologies developed for wastewater treatment and waste recovery. DSS is programmed in Visual Basic where only the active sheets are accessible for the user. Data inputs and other commads are defined as command buttons on these active sheets.\nThe ultimate goal of creating this Decision Support System was to provide easy understandable environmental indicators for various maintenance and investment projects, since this part of the information is usually not considered. In addition, although in many cases environmental prescriptions and regulations have to be kept and followed, they do not always support increasing environmental efficiency. Thus, just following the regulation does not guarantee a progressive approach toward sustainability and an easy approximate calculation of environmental impacts for different investment options can assist decison making.\nIn Project INCOVER we had the opportunity to use some very important and relevant LCA database units, i.e. unit processes, that could be used to make a quick preliminary evaluation of investment and maintenance alternatives at hand. These unit processes build the bases of the DSS. Additionally, a simple economic calculation was also built in to the DSS based on the economic data given by the user. And what is more, the anticipated social impacts of INCOVER technologies is also given on sheet \"sLCA\".\nThe DSS has four active sheets: “Intro”, “Ref_sys”, \"New_tech”, and \"sLCA\". On this sheet “Intro” is the short introduction to the application and the disclimer of the dataset providing company Think Step. The worksheet “Ref_sys” is designed for selecting the reference technology. This is of utmost importance, because the reference technology is the technology with the results of the new technology are compared with. Without this comparison, the sustainbility results are hard to understand and interpret, because sustainabilty assessment is only possible in relative terms, i.e. not absolute but relative sustainability can be assessed. This relativeness is provided by the reference system. In the worksheet “New_tech” the new technology can be defined and this page also contains the environmental and economic results of the conparison. These results are presented in tables and in case of LCA calculations also in charts. On the worksheet \"sLCA\" the user can have a look at the social assessment results of INCOVER technologies.\n\nImportant! Since the application uses macros, before you proceed with calculations, please allow the use of macros in Excel!"]
[]
["Disclaimer"]
["thinkstep AG (database provider) is not liable for the up-to-dateness, correctness, usability, completeness and quality of any calculations, conclusions and other results obtained through the use of the software provided by thinkstep AG and the user data. Any liability of thinkstep AG for the use of the calculations, conclusions and other results obtained through the software use is excluded. The user only is responsible for the up-to-dateness, correctness, usability, completeness and quality of his data, any calculations, conclusions and other results obtained by his data, tools, calculation tools, software and their subsequent use. He bears the sole risk of possible miscalculations, incompleteness, incorrectness and any further deficiencies. thinkstep AG is solely responsible for providing the software and the content already included therein."]
["The project has received funding from the European Union’s Horizon 2020 research and innovation programme under grant agreement No.\n689242. The dissemination of results herein reflects only the author’s view and the Commission is not responsible for any use that may be made of the information it contains."]
{"$rows_left_out":1}
{"sheet":"Ref_sys","index":1,"n_rows":40,"n_cols":2,"rows_kept":40,"cut":false,"hidden":false,"merged":[[0,0,0,1],[19,0,19,1],[18,0,18,1],[17,0,17,1],[3,0,3,1],[9,0,9,1]]}
["Selecting the reference technology"]
["In this worksheet you can select the reference technology that suits the best to your system.\nBear in mind that the function of the reference system should be the same with your system and the size shouldn't alter more than +/-50%.\n"]
[]
["Main features of the selected reference technology"]
["Technology selection","Sequencing batch reactor with sludge settler, flow rate: 300 m3/day"]
["Size of technology, flow rate [m3/day]",{"$f":"VLOOKUP(B5,Inputs!A2:D19,4,FALSE)","v":300}]
{"$rows_left_out":35}
{"sheet":"New_tech","index":2,"n_rows":81,"n_cols":12,"rows_kept":81,"cut":false,"hidden":false,"merged":[[95,8,95,9],[95,11,95,12],[102,11,102,12],[3,0,3,7],[0,0,0,7],[3,8,3,20],[1,0,1,6],[10,0,10,2],[22,0,22,2],[33,0,33,2]]}
["Define your system"]
["This worksheet builds the main part of the application DSS. Here the user can define the composition of the new technology using different material and energy flows. This list of flows comprises the most common building materials and process additives that are used in wastewater treatment (WWT). In addition, you are welcome to define the performance of your technology by giving the input and output values too. To open this dialog box click on the button “Data input”. \nFirst, name the new technology. Next, the life span and the flow rate of the technology has to be defined. As a next step, fill in the first colum where the material and energy flows of the new technology are required. Please, be aware of the dimensions predifined for each flow. There are two main life phases important: construction and operation. In case of construction, the total amounts are to be defined and the calculation adjusts these amount to the total life span of the technology. Operation data should be provided per year and the calculation automatically considers the total amount for the whole life-cycle. \n\nIn the second column the cost of the material and energy flows, and for transportation and personnel has to be given. In addition, you can provide a short description of the newly defined system and provide characteristic input and output indicators describing the technical performance of the technology. To make these inputs understandable for others, please give the dimension as well, e.g. COD 800 [mg/L]. When this dialog box is filled in, click OK to show the results or Cancel to delete the inputs made so far.\n\nThere are three additional buttons available on this sheet: “Record my technology”, “Finish and close”, and “Back”. With the “Record my technology” button you can save the new technology as a reference system and all the inputs and results will be saved to this list. Consequently, when returning to the “Ref_sys” page, among the reference systems in the drop-down you will find the newly saved technology as well. With the “Finish and close” button the Excel file is closed without saving the results! The “Back” button allows to return back to the “Ref_sys” worksheet."]
[]
["Results"]
["Name of selected technologies",{"$f":"B51","v":"New technology"},{"$f":"C51","v":"Sequencing batch reactor with sludge settler, flow rate: 300 m3/day"},null,null,null,{"$f":"B5","v":"New technology"},{"$f":"C5","v":"Sequencing batch reactor with sludge settler, flow rate: 300 m3/day"}]
["Lifespan of technology",{"$f":"B52","v":40},{"$f":"C52","v":40}]
{"$rows_left_out":76}
{"sheet":"sLCA","index":3,"n_rows":27,"n_cols":8,"rows_kept":27,"cut":false,"hidden":false,"merged":[[1,1,1,4],[2,1,17,4],[0,0,0,4],[3,0,17,0]]}
["On this sheet the user can read about the social life-cycle assessment results of the technologies in INCOVER"]
["Name of the evaluated technology - Please choose from the drop-down list!","Description of results of the social life-cycle assessment"]
["Hydrothermal carbonization",{"$f":"VLOOKUP(A3,F20:H27,3,FALSE)","v":"The technology major social impacts are:\n- Creation of local jobs on a technical level during operation and maintenance for the commissioned modules.\n- Creation of significant indirect jobs are not expected. Could be significant if was created a small economy related with large scale production of biochar, which could be used by local agents as carbon sequestration agent, soil amendment and adsorbent/ oin exchanger for water and air purification.\n- Wastewater providers, and equipment or other material local suppliers, and waste management operators will be contracted during O&M. Waste management operators will be contracted during dismantlement. \n- There are physical, ergonomic, chemical and biological contamination risks related with wastewater O&M activities for our staff. Same risks on dismantlement phase. Therefore, health and safety policies, preventive plan and measures should be implemented and emergency protocols regarding workers, beside legal requirements.\n-  Should be feasible to have the technology installed at existing WWTP. However, in case of a stand-alone production plant is envisaged, private land occupation could be some of the emerging social issues.\n- Like others WWTP, this technology could produce odors and liquid effluents, so there is a possibility to arise life quality conflicts on community. \n- Technology energy consumption should not be significant to promote natural resources conflicts on community. The energy balance depends very strongly on the treated biomass. Worst case means that we need energy to heat up the water to 110 °C, the resting needs are coming from the energy recovery at the end of the process. Best case is that there are light energy surpluses, which have to be removed. Most probable case is to install the HTC unit at a place where energy already exists as a surplus, e.g. CHP or a biogas plant.\n- The participation and engagement of the local community should be promoted. It provides transparency, education and social pacification through relevant information to population during the activities and operations. There's an intention to participate on promotion events and communication activities with local community, such as attend to community meetings, promote installation visits, media reports on TV and Internet, newsletters publication, information by email, abstracts or scientific articles, etc.\n- Although there's a capability of job generation, the impact on economic growth of community is not significant. It may be significant in some decades where there will be desertified soils on UE. HTC could provide fertilization capabilities for poor quality, degraded or desertified soils and to use in hydroponic cultures and, therefore, improve production on agriculture activities and promote economic growth.\n- The technology could have impact on pollution mitigation because promotes circular economy and waste reuse and valorization. This technology shows also potential for CO2 reduction comparing to natural rotting processes. Should be applied to wastewater treatment plants where energy or heat surplus already exists (e.g. CHP or a biogas plant), in order to fulfill high energy demands of the technology. The liquid by-product (process water or effluent) is very rich in nutrients, and could be treated or can be used as liquid fertilizer (which needs to be tested first to assess all the impacts). Odor production should be also removed. CO2 is about 80 % of the gas phase.\n- It is expected to give information to users about the resources and origin of biochar and liquid fertilizer, recommended uses for it, or safe disposal. \n- The inadequate use of biochar and liquid fertilizer could arise environmental risks. Is also expected to give this information to users.\n- User, consumer or community satisfaction surveys regarding quality of service should be done.\n"}]
[]
[]
[]
{"$rows_left_out":22}
{"sheet":"Inputs","index":4,"n_rows":19,"n_cols":24,"rows_kept":19,"cut":false,"hidden":false,"merged":[]}
[1,2,3,4,5,6,7,8,9,10,11,12,13,14,15,16,17,18,19,20,21,22,23,24]
["Technology","FU","Reference flow","Flow rate, m3/day","Lifetime","Concrete","PVC pipes","HDPE pipes","Glass fibre reinforced PE pipe","PE plastic parts","PP plastic parts","PVC plastic parts","Glass fibre reinforced PE parts","Pumps","Flocculant PAC18%","Coagulants Polyacrylamide","Polyether polyol","Limestone","Sodium silicate","Process water","Electricity","PV electricity","Heat","Steel components"]
["Conventional wastewater treatment plant, flow rate: 30,137 m3/day","1 m3",440000000,30137,40]
["High-rate algae pond with pretreatment and settler, flow rate: 300 m3/day","1 m3",4380000,300,40,{"$f":"212522+9940+34675.2+501775.2","v":758912.4},{"$f":"90.84+121.23+208.57+11.02+4*50","v":631.66},{"$f":"12.4+11.16+4*80","v":343.56},null,null,{"$f":"1143","v":1143},{"$f":"6858","v":6858},{"$f":"222.56*4","v":890.24},{"$f":"458.8+195+208","v":861.8},{"$f":"82.1*1000","v":82100},{"$f":"12264","v":12264},null,null,null,null,{"$f":"78840+268056+693792+148014.926","v":1188702.926},null,null,{"$f":"30+80.67+30+850+5+85+17292.439+863.835+20*4+40*4+365.151082*4","v":20937.548327999997}]
["Sequencing batch reactor with sludge settler, flow rate: 300 m3/day","1 m3",4380000,300,40,{"$f":"8262+49703.8+177060.3+100128.3","v":335154.39999999997},{"$f":"205.8+44","v":249.8},null,null,null,null,null,null,{"$f":"294+294+266+266","v":1120},255063,9217,null,null,null,null,{"$f":"227059+755172.4+5957157.86","v":6939389.2600000007},null,null,{"$f":"70*2+413.1014957+214.47+2485.191289+8853.015652+708+472+423.9538462+19.6223+5006.4159+240+161.34","v":19137.1104829}]
["Biogas production: 900 Nm3/day","1 Nm3",{"$f":"D6*E6*365","v":6570000},900,20]
{"$rows_left_out":14}
{"sheet":"Results","index":5,"n_rows":20,"n_cols":17,"rows_kept":20,"cut":false,"hidden":false,"merged":[[1,7,1,11],[1,12,1,16]]}
[1,2,3,4,5,6,7,8,9,10,11,12,13,14,15,16,17]
[null,"GWP","EP","AP","HTP","Primary energy demand","Description","INPUT",null,null,null,null,"OUTPUT"]
[null,"kg CO2-eq./FU","kg PO4 eq./FU","kg SO4 eq./FU","kg DCB eq./FU","MJ/FU"]
["Conventional wastewater treatment plant, flow rate: 30,137 m3/day",0.53804044814084695,1.4764066993322399E-2,4.7309643519636603E-3,0.75313764441001696,5.9348730716335698,"This technology contains mechanical, biological and chemical treatment steps for the waste water, and treatment steps for the sludge. The outflow goes directly to the receiving water. The sewage passes through the bar screens for rag removal. Next, the sewage is transported to the grit tanks. In the separator suspended particles such as oils, fats are removed. The settlement tank can remove the larger suspended solids. The aeration tanks provide a location where biological treatment of the sewage takes place. The activated sludge converts organic substances into oxidised products, which are settled out in the secondary clarifiers. Phosphoric acid is used as nutrient for micro-organisms. The cleared overflow in the secondary clarifiers goes to a natural surface water body. The settled solids are pumped to the primary thickener where the solids are thickened. The sludge is pumped to filter presses for dewatering, which use chemical flocculants to separate the water from the solids. Next, the sludge is getting dried with thermal energy. The dried sludge is fed into an incinerator, which produces energy for the wastewater treatment plant.","n.a.","n.a.","n.a.","n.a.","n.a.","n.a.","n.a.","n.a.","n.a.","n.a."]
["High-rate algae pond with pretreatment and settler, flow rate: 300 m3/day",{"$f":"Parameter_tables!K53/Inputs!$C$4","v":0.11000364084546149},{"$f":"Parameter_tables!L53/Inputs!$C$4","v":9.5866823288444939E-5},{"$f":"Parameter_tables!M53/Inputs!$C$4","v":5.3296865756288184E-4},{"$f":"Parameter_tables!N53/Inputs!$C$4","v":0.48291043733327987},{"$f":"Parameter_tables!O53/Inputs!$C$4","v":1.6761248506199409},"This technology is based on a mixture of algae and bacteria that consume the contaminants in the provided wastewater in a collaborative way. Due to this collaboration aeration is not needed that saves a lot of energy. The plant was designed to treat 300 m3 WW per day. The municipal WW first passes a rotary drum filter selecting out solid particles bigger than 1 mm. This pretreatment phase additionally has two pumps and an open tank to store the sold wastes. From here the filtered WW is continuously led to theraceway ponds with an average flow of 12.5 m3/hour. The raceway ponds have an active surface of 3000 m2, a volume of 900 m3, and are designed to operate at a 36-hour hydraulic retention time. The HRAP uses a new less energy intensive patented mixing system (LEAR) with an effective flow pumped of 0.49 m3/s. In the next step the treated WW from the HRAP is led to the separator (DAFAST), where the algae sludge is flocculated and separated from water fraction. The separator consists of a conical flotation tank, a clear water tank, a collection tank, agitator, three pumps, and a polymere dosing unit. In this phase the coagulant poly-aluminum-chlorid and the flocculant polyacrylamide is added. After separation cleared WW is led to the effluent and sludge with 4% dry matter is delivered from the plant.","BOD [mg/L] 350","COD [mg/L] 800","TSS [mg/L] 500","TKN [mg/L] 67","TP [mg/L] 10","BOD [mg/L] 9","COD [mg/L] 80","TSS [mg/L] 20","TKN [mg/L] 15","TP [mg/L] 1"]
["Sequencing batch reactor with sludge settler, flow rate: 300 m3/day",{"$f":"Parameter_tables!K54/Inputs!$C$5","v":0.27500669633653646},{"$f":"Parameter_tables!L54/Inputs!$C$5","v":1.6440547357798364E-4},{"$f":"Parameter_tables!M54/Inputs!$C$5","v":1.1552444508891727E-3},{"$f":"Parameter_tables!N54/Inputs!$C$5","v":0.46170799794601725},{"$f":"Parameter_tables!O54/Inputs!$C$5","v":4.7820917928464892},"The WW treatment plant was designed to clear a WW inflow of max. 300 m3/day, (1,600 PE).The SBR plant consists of a pretreatment unit with a filter and sand trap, a buffer tank, an SBR tank, and a sludge tank. The WW treated has exclusively municipal origins and first passes a filter, where the larger solid particles are selected out. Then the WW passes a sand trap (7 m3) and a buffer tank (110 m3) with a WW pump. Here is the WW stored for the next cycle in the SBR. Up here this phase is considered as pretreatment. Next, WW is treated in the 884 m3 SBR tank. In this tank 3 cycles of WW treatment are done per day, each lasting for 8 hours following this schedule: filling 57.47 min., anaerobic mixing 120 min., react – aerobic mixing 120 min., anoxic mixing 30 min, settle 90 min., decant 57.47 min., idle 4.8 min. Subsequent to the SBR tank, a sludge tank is included where the settled sludge is treated with the addition of PAM (Praestol) to thicken and to obtain a dry matter content of the sludge comparable to the dry matter content of the algal biomass after separation (i.e. ca. 3.5-4.8%).","BOD [mg/L] 350","COD [mg/L] 800","TSS [mg/L] 500","TKN [mg/L] 67","TP [mg/L] 10","BOD [mg/L] 6.75","COD [mg/L] 28.68","TSS [mg/L] 10","TN [mg/L] 12.35","TP [mg/L] 1.34"]
{"$rows_left_out":15}
{"sheet":"Parameter_tables","index":6,"n_rows":86,"n_cols":33,"rows_kept":86,"cut":false,"hidden":false,"merged":[]}
[null,null,null,"GWP","EP","AP","HTP","PE","Costs"]
["Construction",null,null,null,null,null,null,null,"€/unit"]
["Circulating pump 250-1000W, kg","Pump","Pumps",{"$f":"VLOOKUP($B3,LCA_variables!$A$2:$F$24,2,FALSE)","v":3.8305551682551},{"$f":"VLOOKUP($B3,LCA_variables!$A$2:$F$24,3,FALSE)","v":1.2679734419800701E-3},{"$f":"VLOOKUP($B3,LCA_variables!$A$2:$F$24,4,FALSE)","v":1.6310240891866199E-2},{"$f":"VLOOKUP($B3,LCA_variables!$A$2:$F$24,5,FALSE)","v":8.3172091681993692},{"$f":"VLOOKUP($B3,LCA_variables!$A$2:$F$24,6,FALSE)","v":54.459634633891298},11]
["PVC Pipe, kg","PVC_pipe","PVC pipes",{"$f":"VLOOKUP($B4,LCA_variables!$A$2:$F$24,2,FALSE)","v":3.3203249900464602},{"$f":"VLOOKUP($B4,LCA_variables!$A$2:$F$24,3,FALSE)","v":1.19454712628066E-3},{"$f":"VLOOKUP($B4,LCA_variables!$A$2:$F$24,4,FALSE)","v":1.4801351085148001E-2},{"$f":"VLOOKUP($B4,LCA_variables!$A$2:$F$24,5,FALSE)","v":6.2699094229076904},{"$f":"VLOOKUP($B4,LCA_variables!$A$2:$F$24,6,FALSE)","v":65.859118767786399},14]
["HDPE Pipe, kg","HDPE_pipe","HDPE pipes",{"$f":"VLOOKUP($B5,LCA_variables!$A$2:$F$24,2,FALSE)","v":2.0206785436920001},{"$f":"VLOOKUP($B5,LCA_variables!$A$2:$F$24,3,FALSE)","v":4.8913160147916602E-4},{"$f":"VLOOKUP($B5,LCA_variables!$A$2:$F$24,4,FALSE)","v":4.3893663203704997E-3},{"$f":"VLOOKUP($B5,LCA_variables!$A$2:$F$24,5,FALSE)","v":0.169262847815526},{"$f":"VLOOKUP($B5,LCA_variables!$A$2:$F$24,6,FALSE)","v":82.918443158772007},6.2]
["Glass fibre reinforced pipe, kg","GFR_pipe","Glass fibre reinforced PE pipes",{"$f":"VLOOKUP($B6,LCA_variables!$A$2:$F$24,2,FALSE)","v":1.5027040121114099},{"$f":"VLOOKUP($B6,LCA_variables!$A$2:$F$24,3,FALSE)","v":3.5420494405989899E-4},{"$f":"VLOOKUP($B6,LCA_variables!$A$2:$F$24,4,FALSE)","v":3.2398225654614002E-3},{"$f":"VLOOKUP($B6,LCA_variables!$A$2:$F$24,5,FALSE)","v":9.7055292292209397E-2},{"$f":"VLOOKUP($B6,LCA_variables!$A$2:$F$24,6,FALSE)","v":36.314364024436003},18]
{"$rows_left_out":81}
{"sheet":"LCA_variables","index":7,"n_rows":78,"n_cols":23,"rows_kept":78,"cut":false,"hidden":false,"merged":[]}
[null,"kg CO2 eq.","kg Phosphate eq.","kg SO2 eq.","kg DCB eq.","MJ"]
["Biogas",0.27300359465975599,1.7974528011364E-3,2.52904418461559E-3,-9.6402765289138707E-3,2.2678308860182201]
["CA",27.172319060028698,5.0397259438794202E-2,0.206158211576456,16.598611729979901,326.85446855417098]
["Concrete",9.0822291961504195E-2,2.7543897746763902E-5,1.7191631256922301E-4,2.6135125225518599E-2,0.50527631191706801]
["Electricity",0.115889567588735,3.0669157757711998E-5,3.2731055879038601E-4,6.4334546567663001E-3,2.2120664120437201]
["GFR_pipe",1.5027040121114099,3.5420494405989899E-4,3.2398225654614002E-3,9.7055292292209397E-2,36.314364024436003]
{"$rows_left_out":73}
{"sheet":"Pictures","index":8,"n_rows":26,"n_cols":4,"rows_kept":26,"cut":false,"hidden":false,"merged":[]}
["https://www.youtube.com/watch?v=rTyZmSHDLBA",null,null,{"$f":"Ref_sys!B5","v":"Sequencing batch reactor with sludge settler, flow rate: 300 m3/day"}]
["Conventional wastewater treatment plant, flow rate: 30,137 m3/day","no picture available"]
["High-rate algae pond with pretreatment and settler, flow rate: 300 m3/day"]
["Sequencing batch reactor with sludge settler, flow rate: 300 m3/day"]
["Biogas production: 900 Nm3/day"]
["Algae-based biogas upgrade with HRAP, flow rate: 0.05 m3/dy"]
{"$rows_left_out":21}
{"sheet":"My_techn","index":9,"n_rows":3,"n_cols":24,"rows_kept":3,"cut":false,"hidden":false,"merged":[[1,7,1,11],[1,12,1,16]]}
[{"$f":"New_tech!B51","v":"New technology"},null,{"$f":"New_tech!$B$9","v":4380000},{"$f":"New_tech!B8","v":300},{"$f":"New_tech!B7","v":40},{"$f":"New_tech!D56","v":50},{"$f":"New_tech!$D57","v":0},{"$f":"New_tech!$D58","v":56},{"$f":"New_tech!$D59","v":0},{"$f":"New_tech!$D60","v":0},{"$f":"New_tech!$D61","v":0},{"$f":"New_tech!$D62","v":0},{"$f":"New_tech!$D63","v":0},{"$f":"New_tech!$D64","v":200},{"$f":"New_tech!$D65","v":0},{"$f":"New_tech!$D66","v":1460000},{"$f":"New_tech!$D67","v":0},{"$f":"New_tech!$D68","v":0},{"$f":"New_tech!$D69","v":0},{"$f":"New_tech!$D70","v":0},{"$f":"New_tech!$D71","v":5256000},{"$f":"New_tech!$D72","v":0},{"$f":"New_tech!$D73","v":0},{"$f":"New_tech!D74","v":10}]
[null,"GWP","EP","AC","HTP","PED","System description","INPUT",null,null,null,null,"OUTPUT"]
[{"$f":"New_tech!B51","v":"New technology"},{"$f":"Parameter_tables!K68/$C$1","v":1.0983278038572926},{"$f":"Parameter_tables!L68/$C$1","v":2.954455874247656E-3},{"$f":"Parameter_tables!M68/$C$1","v":5.9560531235069124E-3},{"$f":"Parameter_tables!N68/$C$1","v":0.44955564021275102},{"$f":"Parameter_tables!O68/$C$1","v":25.906032022619605},{"$f":"New_tech!F82","v":0},{"$f":"New_tech!G82","v":0},{"$f":"New_tech!H82","v":0},{"$f":"New_tech!I82","v":0},{"$f":"New_tech!J82","v":0},{"$f":"New_tech!K82","v":0},{"$f":"New_tech!L82","v":0},{"$f":"New_tech!M82","v":0},{"$f":"New_tech!N82","v":0},{"$f":"New_tech!O82","v":0},{"$f":"New_tech!P82","v":0}]